unofficial mirror of bug-guix@gnu.org 
 help / color / Atom feed
* bug#42062: python-autopep8 fails its test suite
@ 2020-06-26 16:09 Maxim Cournoyer
  2020-06-26 17:51 ` bug#42062: Status: " Maxim Cournoyer
  0 siblings, 1 reply; 2+ messages in thread
From: Maxim Cournoyer @ 2020-06-26 16:09 UTC (permalink / raw)
  To: 42062

Hello,

I've seen this with a frehsly pulled Guix (commit
93ff6a40e4f4c7f5d7b8af558a537732b919d0ec):

======================================================================
FAIL: test_e501_experimental_decorator (test.test_autopep8.ExperimentalSystemTests)
----------------------------------------------------------------------
Traceback (most recent call last):
  File "/tmp/guix-build-python-autopep8-1.3.5.drv-0/autopep8-1.3.5/test/test_autopep8.py", line 5847, in test_e501_experimental_decorator
    self.assertEqual(fixed, result)
AssertionError: "\n\n@foo(('xxxxxxxxxxxxxxxxxxxxxxxxxx', u[123 chars]))\n" != "@foo(('xxxxxxxxxxxxxxxxxxxxxxxxxx', users[119 chars]))\n"
- 
- 
  @foo(('xxxxxxxxxxxxxxxxxxxxxxxxxx', users.xxxxxxxxxxxxxxxxxxxxxxxxxx),
       ('yyyyyyyyyyyy', users.yyyyyyyyyyyy),
       ('zzzzzzzzzzzzzz', users.zzzzzzzzzzzzzz))


======================================================================
FAIL: test_e501_experimental_with_function_should_not_break_on_colon (test.test_autopep8.ExperimentalSystemTests)
----------------------------------------------------------------------
Traceback (most recent call last):
  File "/tmp/guix-build-python-autopep8-1.3.5.drv-0/autopep8-1.3.5/test/test_autopep8.py", line 5451, in test_e501_experimental_with_function_should_not_break_on_colon
    self.assertEqual(fixed, result)
AssertionError: '\ncl[112 chars]et or(\n                widget.__class__ == Wi[88 chars]se\n' != '\ncl[112 chars]et or (\n                widget.__class__ == W[89 chars]se\n'
  
  class Useless(object):
  
      def _table_field_is_plain_widget(self, widget):
-         if widget.__class__ == Widget or(
+         if widget.__class__ == Widget or (
?                                         +
                  widget.__class__ == WidgetMeta and Widget in widget.__bases__):
              return True
  
          return False


======================================================================
FAIL: test_e501_more_aggressive_with_def (test.test_autopep8.SystemTests)
----------------------------------------------------------------------
Traceback (most recent call last):
  File "/tmp/guix-build-python-autopep8-1.3.5.drv-0/autopep8-1.3.5/test/test_autopep8.py", line 3429, in test_e501_more_aggressive_with_def
    self.assertEqual(fixed, result)
AssertionError: '\n\ndef foobar(\n        sldfkjlsdfsdf,\n[179 chars]ss\n' != 'def foobar(\n        sldfkjlsdfsdf,\n    [175 chars]ss\n'
- 
- 
  def foobar(
          sldfkjlsdfsdf,
          kksdfsdfsf,
          sdfsdfsdf,
          sdfsdfkdk,
          szdfsdfsdf,
          sdfsdfsdfsdlkfjsdlf,
          sdfsdfddf,
          sdfsdfsfd,
          sdfsdfdsf):
      pass


----------------------------------------------------------------------
Ran 505 tests in 18.107s

FAILED (failures=3, skipped=4)
Test failed: <unittest.runner.TextTestResult run=505 errors=0 failures=3>
error: Test failed: <unittest.runner.TextTestResult run=505 errors=0 failures=3>
command "python" "-c" "import setuptools, tokenize;__file__='setup.py';f=getattr(tokenize, 'open', open)(__file__);code=f.read().replace('\\r\\n', '\\n');f.close();exec(compile(code, __file__, 'exec'))" "test" failed with status 1

Maxim




^ permalink raw reply	[flat|nested] 2+ messages in thread

* bug#42062: Status: python-autopep8 fails its test suite
  2020-06-26 16:09 bug#42062: python-autopep8 fails its test suite Maxim Cournoyer
@ 2020-06-26 17:51 ` Maxim Cournoyer
  0 siblings, 0 replies; 2+ messages in thread
From: Maxim Cournoyer @ 2020-06-26 17:51 UTC (permalink / raw)
  To: bug#42062

Fixed with commit c0dd4140f6.

Closing,

Maxim




^ permalink raw reply	[flat|nested] 2+ messages in thread

end of thread, back to index

Thread overview: 2+ messages (download: mbox.gz / follow: Atom feed)
-- links below jump to the message on this page --
2020-06-26 16:09 bug#42062: python-autopep8 fails its test suite Maxim Cournoyer
2020-06-26 17:51 ` bug#42062: Status: " Maxim Cournoyer

unofficial mirror of bug-guix@gnu.org 

Archives are clonable:
	git clone --mirror https://yhetil.org/guix-bugs/0 guix-bugs/git/0.git

	# If you have public-inbox 1.1+ installed, you may
	# initialize and index your mirror using the following commands:
	public-inbox-init -V2 guix-bugs guix-bugs/ https://yhetil.org/guix-bugs \
		bug-guix@gnu.org
	public-inbox-index guix-bugs

Example config snippet for mirrors

Newsgroups are available over NNTP:
	nntp://news.yhetil.org/yhetil.gnu.guix.bugs
	nntp://news.gmane.io/gmane.comp.gnu.guix.bugs


AGPL code for this site: git clone https://public-inbox.org/public-inbox.git