unofficial mirror of bug-guix@gnu.org 
 help / color / mirror / Atom feed
* bug#47928: go-gopkg-in-yaml-v2-2.2.2 build fails
@ 2021-04-21  1:46 Bone Baboon via Bug reports for GNU Guix
  2021-04-26 15:17 ` raingloom
                   ` (2 more replies)
  0 siblings, 3 replies; 7+ messages in thread
From: Bone Baboon via Bug reports for GNU Guix @ 2021-04-21  1:46 UTC (permalink / raw)
  To: 47928

On a i686 computer when I run `sudo guix system --no-substitutes --cores=1 --max-jobs=1 reconfigure config.scm` I get this error:

```
building /gnu/store/yqwd4wbam8mx0n2idy1qj4861rzvra7n-go-gopkg-in-yaml-v2-2.2.2.drv...
| 'check' phasebuilder for `/gnu/store/yqwd4wbam8mx0n2idy1qj4861rzvra7n-go-gopkg-in-yaml-v2-2.2.2.drv' failed with exit code 1
build of /gnu/store/yqwd4wbam8mx0n2idy1qj4861rzvra7n-go-gopkg-in-yaml-v2-2.2.2.drv failed
View build log at '/var/log/guix/drvs/yq/wd4wbam8mx0n2idy1qj4861rzvra7n-go-gopkg-in-yaml-v2-2.2.2.drv.bz2'.
cannot build derivation `/gnu/store/qkinjq5fkp3vd70g6vcf3wwd66d0slq7-docker-libnetwork-cmd-proxy-19.03-1.55e924b.drv': 1 dependencies couldn't be built
cannot build derivation `/gnu/store/6vi73j6gn3g3xdg30wp0kdmdg0nhxan6-gotestsum-0.4.0.drv': 1 dependencies couldn't be built
cannot build derivation `/gnu/store/8s9kwwcg5wilqkl3mgysr0mg12dj10zq-docker-19.03.15.drv': 1 dependencies couldn't be built
guix system: error: build of `/gnu/store/8s9kwwcg5wilqkl3mgysr0mg12dj10zq-docker-19.03.15.drv' failed
```

`guix describe` outputs:

```
Generation 7    Apr 20 2021 18:12:09    (current)
  guix 0e21cf7
    repository URL: https://git.savannah.gnu.org/git/guix.git
    branch: master
    commit: 0e21cf7d0620caf3fe9bed4f6ec1d5239a599a6a
```

The build log contents:

```
starting phase `set-SOURCE-DATE-EPOCH'
phase `set-SOURCE-DATE-EPOCH' succeeded after 0.0 seconds
starting phase `set-paths'
environment variable `PATH' set to `/gnu/store/ghvg7wa0m2dih1nibxja66m86q1ffm6w-go-1.14.15/bin:/gnu/store/gww59gv5qxbfijg3vk5y182im7923s06-tar-1.32/bin:/gnu/store/2ayciqwxddkzq183dac82ijljc14j4zj-gzip-1.10/bin:/gnu/store/n1jk0w2wa4vpwmixaqn2y3la1l2sizzi-bzip2-1.0.8/bin:/gnu/store/7p36raqgk6vn47bflxc9bsclqiib3phi-xz-5.2.4/bin:/gnu/store/lpkf3ydcdvxn8gcrzaq9cp3ri05h8qhs-file-5.38/bin:/gnu/store/6gqaw09zqw8w0vcax6simlq71bq7l5r0-diffutils-3.7/bin:/gnu/store/qw20chpgkgbcqmzhs60c8hjl1hmblyc8-patch-2.7.6/bin:/gnu/store/b5y5scfmh2d8kxcpl9p84294z2198cgf-findutils-4.7.0/bin:/gnu/store/9iwlsj7d6ffqhshy8qshf7p4fqwfwrvn-gawk-5.0.1/bin:/gnu/store/q1nfjb24vqjs1cgi8mlnskw34h16y09r-sed-4.8/bin:/gnu/store/4qr6mcvsxyzknxa7x1wny8x30f5i0r3n-grep-3.4/bin:/gnu/store/2v61vg0bizgrhybkqbrki2k7kr094waz-coreutils-8.32/bin:/gnu/store/b7jbh7kzzig0bxfswdj8nfj9bkljyyya-make-4.3/bin:/gnu/store/v1g7f3p4f0851mywrla8qmr9hb8jgfjr-bash-minimal-5.0.16/bin:/gnu/store/dyqxnydqk1810afjfbqzfvh0n83xyl62-ld-wrapper-0/bin:/gnu/store/50lyzn9bz6x4da66648kry29wn8afird-binutils-2.34/bin:/gnu/store/afpgzln8860m6yfhxy6i8n9rywbp85cy-gcc-7.5.0/bin:/gnu/store/z4li262il798hbl0l1h1k3a5g7r6bffa-glibc-2.31/bin:/gnu/store/z4li262il798hbl0l1h1k3a5g7r6bffa-glibc-2.31/sbin'
environment variable `BASH_LOADABLES_PATH' unset
environment variable `C_INCLUDE_PATH' set to `/gnu/store/n1jk0w2wa4vpwmixaqn2y3la1l2sizzi-bzip2-1.0.8/include:/gnu/store/7p36raqgk6vn47bflxc9bsclqiib3phi-xz-5.2.4/include:/gnu/store/lpkf3ydcdvxn8gcrzaq9cp3ri05h8qhs-file-5.38/include:/gnu/store/9iwlsj7d6ffqhshy8qshf7p4fqwfwrvn-gawk-5.0.1/include:/gnu/store/b7jbh7kzzig0bxfswdj8nfj9bkljyyya-make-4.3/include:/gnu/store/50lyzn9bz6x4da66648kry29wn8afird-binutils-2.34/include:/gnu/store/afpgzln8860m6yfhxy6i8n9rywbp85cy-gcc-7.5.0/include:/gnu/store/z4li262il798hbl0l1h1k3a5g7r6bffa-glibc-2.31/include:/gnu/store/hk7l42fwxmnrnlhyiixvaqf1i1crcckp-linux-libre-headers-5.4.20/include'
environment variable `CPLUS_INCLUDE_PATH' set to `/gnu/store/n1jk0w2wa4vpwmixaqn2y3la1l2sizzi-bzip2-1.0.8/include:/gnu/store/7p36raqgk6vn47bflxc9bsclqiib3phi-xz-5.2.4/include:/gnu/store/lpkf3ydcdvxn8gcrzaq9cp3ri05h8qhs-file-5.38/include:/gnu/store/9iwlsj7d6ffqhshy8qshf7p4fqwfwrvn-gawk-5.0.1/include:/gnu/store/b7jbh7kzzig0bxfswdj8nfj9bkljyyya-make-4.3/include:/gnu/store/50lyzn9bz6x4da66648kry29wn8afird-binutils-2.34/include:/gnu/store/afpgzln8860m6yfhxy6i8n9rywbp85cy-gcc-7.5.0/include/c++:/gnu/store/afpgzln8860m6yfhxy6i8n9rywbp85cy-gcc-7.5.0/include:/gnu/store/z4li262il798hbl0l1h1k3a5g7r6bffa-glibc-2.31/include:/gnu/store/hk7l42fwxmnrnlhyiixvaqf1i1crcckp-linux-libre-headers-5.4.20/include'
environment variable `LIBRARY_PATH' set to `/gnu/store/ghvg7wa0m2dih1nibxja66m86q1ffm6w-go-1.14.15/lib:/gnu/store/n1jk0w2wa4vpwmixaqn2y3la1l2sizzi-bzip2-1.0.8/lib:/gnu/store/7p36raqgk6vn47bflxc9bsclqiib3phi-xz-5.2.4/lib:/gnu/store/lpkf3ydcdvxn8gcrzaq9cp3ri05h8qhs-file-5.38/lib:/gnu/store/9iwlsj7d6ffqhshy8qshf7p4fqwfwrvn-gawk-5.0.1/lib:/gnu/store/50lyzn9bz6x4da66648kry29wn8afird-binutils-2.34/lib:/gnu/store/z4li262il798hbl0l1h1k3a5g7r6bffa-glibc-2.31/lib:/gnu/store/rzk3v28mhi4m7sh0qippp9a5rzy03rkg-glibc-2.31-static/lib:/gnu/store/x6i3vfg4gaqd42cqb6mzk52v4lds1467-glibc-utf8-locales-2.31/lib'
environment variable `GUIX_LOCPATH' set to `/gnu/store/x6i3vfg4gaqd42cqb6mzk52v4lds1467-glibc-utf8-locales-2.31/lib/locale'
phase `set-paths' succeeded after 0.1 seconds
starting phase `install-locale'
using 'en_US.utf8' locale for category "LC_ALL"
phase `install-locale' succeeded after 0.0 seconds
starting phase `setup-go-environment'
`/tmp/fileipQEjf/src/github.com/kr/text/indent.go' -> `/tmp/guix-build-go-gopkg-in-yaml-v2-2.2.2.drv-0/src/github.com/kr/text/indent.go'
`/tmp/fileipQEjf/src/github.com/kr/text/indent_test.go' -> `/tmp/guix-build-go-gopkg-in-yaml-v2-2.2.2.drv-0/src/github.com/kr/text/indent_test.go'
`/tmp/fileipQEjf/src/github.com/kr/text/wrap.go' -> `/tmp/guix-build-go-gopkg-in-yaml-v2-2.2.2.drv-0/src/github.com/kr/text/wrap.go'
`/tmp/fileipQEjf/src/github.com/kr/text/wrap_test.go' -> `/tmp/guix-build-go-gopkg-in-yaml-v2-2.2.2.drv-0/src/github.com/kr/text/wrap_test.go'
`/tmp/fileipQEjf/src/github.com/kr/text/doc.go' -> `/tmp/guix-build-go-gopkg-in-yaml-v2-2.2.2.drv-0/src/github.com/kr/text/doc.go'
`/tmp/fileipQEjf/src/github.com/kr/text/go.mod' -> `/tmp/guix-build-go-gopkg-in-yaml-v2-2.2.2.drv-0/src/github.com/kr/text/go.mod'
`/tmp/fileipQEjf/src/github.com/kr/text/License' -> `/tmp/guix-build-go-gopkg-in-yaml-v2-2.2.2.drv-0/src/github.com/kr/text/License'
`/tmp/fileipQEjf/src/github.com/kr/text/Readme' -> `/tmp/guix-build-go-gopkg-in-yaml-v2-2.2.2.drv-0/src/github.com/kr/text/Readme'
`/tmp/fileipQEjf/src/github.com/kr/text/cmd/agg/main.go' -> `/tmp/guix-build-go-gopkg-in-yaml-v2-2.2.2.drv-0/src/github.com/kr/text/cmd/agg/main.go'
`/tmp/fileipQEjf/src/github.com/kr/text/cmd/agg/string.go' -> `/tmp/guix-build-go-gopkg-in-yaml-v2-2.2.2.drv-0/src/github.com/kr/text/cmd/agg/string.go'
`/tmp/fileipQEjf/src/github.com/kr/text/cmd/agg/doc.go' -> `/tmp/guix-build-go-gopkg-in-yaml-v2-2.2.2.drv-0/src/github.com/kr/text/cmd/agg/doc.go'
`/tmp/fileipQEjf/src/github.com/kr/text/cmd/agg/num.go' -> `/tmp/guix-build-go-gopkg-in-yaml-v2-2.2.2.drv-0/src/github.com/kr/text/cmd/agg/num.go'
`/tmp/fileipQEjf/src/github.com/kr/text/mc/mc.go' -> `/tmp/guix-build-go-gopkg-in-yaml-v2-2.2.2.drv-0/src/github.com/kr/text/mc/mc.go'
`/tmp/fileipQEjf/src/github.com/kr/text/mc/Readme' -> `/tmp/guix-build-go-gopkg-in-yaml-v2-2.2.2.drv-0/src/github.com/kr/text/mc/Readme'
`/tmp/fileipQEjf/src/github.com/kr/text/colwriter/column.go' -> `/tmp/guix-build-go-gopkg-in-yaml-v2-2.2.2.drv-0/src/github.com/kr/text/colwriter/column.go'
`/tmp/fileipQEjf/src/github.com/kr/text/colwriter/column_test.go' -> `/tmp/guix-build-go-gopkg-in-yaml-v2-2.2.2.drv-0/src/github.com/kr/text/colwriter/column_test.go'
`/tmp/fileipQEjf/src/github.com/kr/text/colwriter/Readme' -> `/tmp/guix-build-go-gopkg-in-yaml-v2-2.2.2.drv-0/src/github.com/kr/text/colwriter/Readme'
`/tmp/fileipQEjf/src/github.com/kr/pretty/example_test.go' -> `/tmp/guix-build-go-gopkg-in-yaml-v2-2.2.2.drv-0/src/github.com/kr/pretty/example_test.go'
`/tmp/fileipQEjf/src/github.com/kr/pretty/formatter_test.go' -> `/tmp/guix-build-go-gopkg-in-yaml-v2-2.2.2.drv-0/src/github.com/kr/pretty/formatter_test.go'
`/tmp/fileipQEjf/src/github.com/kr/pretty/formatter.go' -> `/tmp/guix-build-go-gopkg-in-yaml-v2-2.2.2.drv-0/src/github.com/kr/pretty/formatter.go'
`/tmp/fileipQEjf/src/github.com/kr/pretty/diff.go' -> `/tmp/guix-build-go-gopkg-in-yaml-v2-2.2.2.drv-0/src/github.com/kr/pretty/diff.go'
`/tmp/fileipQEjf/src/github.com/kr/pretty/go.mod' -> `/tmp/guix-build-go-gopkg-in-yaml-v2-2.2.2.drv-0/src/github.com/kr/pretty/go.mod'
`/tmp/fileipQEjf/src/github.com/kr/pretty/zero.go' -> `/tmp/guix-build-go-gopkg-in-yaml-v2-2.2.2.drv-0/src/github.com/kr/pretty/zero.go'
`/tmp/fileipQEjf/src/github.com/kr/pretty/License' -> `/tmp/guix-build-go-gopkg-in-yaml-v2-2.2.2.drv-0/src/github.com/kr/pretty/License'
`/tmp/fileipQEjf/src/github.com/kr/pretty/diff_test.go' -> `/tmp/guix-build-go-gopkg-in-yaml-v2-2.2.2.drv-0/src/github.com/kr/pretty/diff_test.go'
`/tmp/fileipQEjf/src/github.com/kr/pretty/go.sum' -> `/tmp/guix-build-go-gopkg-in-yaml-v2-2.2.2.drv-0/src/github.com/kr/pretty/go.sum'
`/tmp/fileipQEjf/src/github.com/kr/pretty/pretty.go' -> `/tmp/guix-build-go-gopkg-in-yaml-v2-2.2.2.drv-0/src/github.com/kr/pretty/pretty.go'
`/tmp/fileipQEjf/src/github.com/kr/pretty/.gitignore' -> `/tmp/guix-build-go-gopkg-in-yaml-v2-2.2.2.drv-0/src/github.com/kr/pretty/.gitignore'
`/tmp/fileipQEjf/src/github.com/kr/pretty/Readme' -> `/tmp/guix-build-go-gopkg-in-yaml-v2-2.2.2.drv-0/src/github.com/kr/pretty/Readme'
`/tmp/fileipQEjf/src/gopkg.in/check.v1/benchmark.go' -> `/tmp/guix-build-go-gopkg-in-yaml-v2-2.2.2.drv-0/src/gopkg.in/check.v1/benchmark.go'
`/tmp/fileipQEjf/src/gopkg.in/check.v1/helpers_test.go' -> `/tmp/guix-build-go-gopkg-in-yaml-v2-2.2.2.drv-0/src/gopkg.in/check.v1/helpers_test.go'
`/tmp/fileipQEjf/src/gopkg.in/check.v1/bootstrap_test.go' -> `/tmp/guix-build-go-gopkg-in-yaml-v2-2.2.2.drv-0/src/gopkg.in/check.v1/bootstrap_test.go'
`/tmp/fileipQEjf/src/gopkg.in/check.v1/check_test.go' -> `/tmp/guix-build-go-gopkg-in-yaml-v2-2.2.2.drv-0/src/gopkg.in/check.v1/check_test.go'
`/tmp/fileipQEjf/src/gopkg.in/check.v1/README.md' -> `/tmp/guix-build-go-gopkg-in-yaml-v2-2.2.2.drv-0/src/gopkg.in/check.v1/README.md'
`/tmp/fileipQEjf/src/gopkg.in/check.v1/foundation_test.go' -> `/tmp/guix-build-go-gopkg-in-yaml-v2-2.2.2.drv-0/src/gopkg.in/check.v1/foundation_test.go'
`/tmp/fileipQEjf/src/gopkg.in/check.v1/run.go' -> `/tmp/guix-build-go-gopkg-in-yaml-v2-2.2.2.drv-0/src/gopkg.in/check.v1/run.go'
`/tmp/fileipQEjf/src/gopkg.in/check.v1/reporter.go' -> `/tmp/guix-build-go-gopkg-in-yaml-v2-2.2.2.drv-0/src/gopkg.in/check.v1/reporter.go'
`/tmp/fileipQEjf/src/gopkg.in/check.v1/checkers_test.go' -> `/tmp/guix-build-go-gopkg-in-yaml-v2-2.2.2.drv-0/src/gopkg.in/check.v1/checkers_test.go'
`/tmp/fileipQEjf/src/gopkg.in/check.v1/LICENSE' -> `/tmp/guix-build-go-gopkg-in-yaml-v2-2.2.2.drv-0/src/gopkg.in/check.v1/LICENSE'
`/tmp/fileipQEjf/src/gopkg.in/check.v1/TODO' -> `/tmp/guix-build-go-gopkg-in-yaml-v2-2.2.2.drv-0/src/gopkg.in/check.v1/TODO'
`/tmp/fileipQEjf/src/gopkg.in/check.v1/checkers.go' -> `/tmp/guix-build-go-gopkg-in-yaml-v2-2.2.2.drv-0/src/gopkg.in/check.v1/checkers.go'
`/tmp/fileipQEjf/src/gopkg.in/check.v1/reporter_test.go' -> `/tmp/guix-build-go-gopkg-in-yaml-v2-2.2.2.drv-0/src/gopkg.in/check.v1/reporter_test.go'
`/tmp/fileipQEjf/src/gopkg.in/check.v1/.travis.yml' -> `/tmp/guix-build-go-gopkg-in-yaml-v2-2.2.2.drv-0/src/gopkg.in/check.v1/.travis.yml'
`/tmp/fileipQEjf/src/gopkg.in/check.v1/export_test.go' -> `/tmp/guix-build-go-gopkg-in-yaml-v2-2.2.2.drv-0/src/gopkg.in/check.v1/export_test.go'
`/tmp/fileipQEjf/src/gopkg.in/check.v1/run_test.go' -> `/tmp/guix-build-go-gopkg-in-yaml-v2-2.2.2.drv-0/src/gopkg.in/check.v1/run_test.go'
`/tmp/fileipQEjf/src/gopkg.in/check.v1/fixture_test.go' -> `/tmp/guix-build-go-gopkg-in-yaml-v2-2.2.2.drv-0/src/gopkg.in/check.v1/fixture_test.go'
`/tmp/fileipQEjf/src/gopkg.in/check.v1/benchmark_test.go' -> `/tmp/guix-build-go-gopkg-in-yaml-v2-2.2.2.drv-0/src/gopkg.in/check.v1/benchmark_test.go'
`/tmp/fileipQEjf/src/gopkg.in/check.v1/helpers.go' -> `/tmp/guix-build-go-gopkg-in-yaml-v2-2.2.2.drv-0/src/gopkg.in/check.v1/helpers.go'
`/tmp/fileipQEjf/src/gopkg.in/check.v1/.gitignore' -> `/tmp/guix-build-go-gopkg-in-yaml-v2-2.2.2.drv-0/src/gopkg.in/check.v1/.gitignore'
`/tmp/fileipQEjf/src/gopkg.in/check.v1/printer_test.go' -> `/tmp/guix-build-go-gopkg-in-yaml-v2-2.2.2.drv-0/src/gopkg.in/check.v1/printer_test.go'
`/tmp/fileipQEjf/src/gopkg.in/check.v1/printer.go' -> `/tmp/guix-build-go-gopkg-in-yaml-v2-2.2.2.drv-0/src/gopkg.in/check.v1/printer.go'
`/tmp/fileipQEjf/src/gopkg.in/check.v1/check.go' -> `/tmp/guix-build-go-gopkg-in-yaml-v2-2.2.2.drv-0/src/gopkg.in/check.v1/check.go'
`/tmp/fileipQEjf/src/gopkg.in/check.v1/integration_test.go' -> `/tmp/guix-build-go-gopkg-in-yaml-v2-2.2.2.drv-0/src/gopkg.in/check.v1/integration_test.go'
`/tmp/fileipQEjf/share/doc/go-github-com-kr-pretty-0.2.1/License' -> `/tmp/guix-build-go-gopkg-in-yaml-v2-2.2.2.drv-0/share/doc/go-github-com-kr-pretty-0.2.1/License'
`/tmp/fileipQEjf/share/doc/go-gopkg-in-check-v1-1.0.0-1.788fd78/LICENSE' -> `/tmp/guix-build-go-gopkg-in-yaml-v2-2.2.2.drv-0/share/doc/go-gopkg-in-check-v1-1.0.0-1.788fd78/LICENSE'
`/tmp/fileipQEjf/share/doc/go-github-com-kr-text-0.1.0/License' -> `/tmp/guix-build-go-gopkg-in-yaml-v2-2.2.2.drv-0/share/doc/go-github-com-kr-text-0.1.0/License'
phase `setup-go-environment' succeeded after 0.2 seconds
starting phase `unpack'
`/gnu/store/iif7mdhbsisj7k213vv7f1n8x1krm0f5-go-gopkg-in-yaml-v2-2.2.2-checkout/writerc.go' -> `/tmp/guix-build-go-gopkg-in-yaml-v2-2.2.2.drv-0/src/gopkg.in/yaml.v2/writerc.go'
`/gnu/store/iif7mdhbsisj7k213vv7f1n8x1krm0f5-go-gopkg-in-yaml-v2-2.2.2-checkout/encode.go' -> `/tmp/guix-build-go-gopkg-in-yaml-v2-2.2.2.drv-0/src/gopkg.in/yaml.v2/encode.go'
`/gnu/store/iif7mdhbsisj7k213vv7f1n8x1krm0f5-go-gopkg-in-yaml-v2-2.2.2-checkout/suite_test.go' -> `/tmp/guix-build-go-gopkg-in-yaml-v2-2.2.2.drv-0/src/gopkg.in/yaml.v2/suite_test.go'
`/gnu/store/iif7mdhbsisj7k213vv7f1n8x1krm0f5-go-gopkg-in-yaml-v2-2.2.2-checkout/NOTICE' -> `/tmp/guix-build-go-gopkg-in-yaml-v2-2.2.2.drv-0/src/gopkg.in/yaml.v2/NOTICE'
`/gnu/store/iif7mdhbsisj7k213vv7f1n8x1krm0f5-go-gopkg-in-yaml-v2-2.2.2-checkout/README.md' -> `/tmp/guix-build-go-gopkg-in-yaml-v2-2.2.2.drv-0/src/gopkg.in/yaml.v2/README.md'
`/gnu/store/iif7mdhbsisj7k213vv7f1n8x1krm0f5-go-gopkg-in-yaml-v2-2.2.2-checkout/LICENSE.libyaml' -> `/tmp/guix-build-go-gopkg-in-yaml-v2-2.2.2.drv-0/src/gopkg.in/yaml.v2/LICENSE.libyaml'
`/gnu/store/iif7mdhbsisj7k213vv7f1n8x1krm0f5-go-gopkg-in-yaml-v2-2.2.2-checkout/example_embedded_test.go' -> `/tmp/guix-build-go-gopkg-in-yaml-v2-2.2.2.drv-0/src/gopkg.in/yaml.v2/example_embedded_test.go'
`/gnu/store/iif7mdhbsisj7k213vv7f1n8x1krm0f5-go-gopkg-in-yaml-v2-2.2.2-checkout/scannerc.go' -> `/tmp/guix-build-go-gopkg-in-yaml-v2-2.2.2.drv-0/src/gopkg.in/yaml.v2/scannerc.go'
`/gnu/store/iif7mdhbsisj7k213vv7f1n8x1krm0f5-go-gopkg-in-yaml-v2-2.2.2-checkout/LICENSE' -> `/tmp/guix-build-go-gopkg-in-yaml-v2-2.2.2.drv-0/src/gopkg.in/yaml.v2/LICENSE'
`/gnu/store/iif7mdhbsisj7k213vv7f1n8x1krm0f5-go-gopkg-in-yaml-v2-2.2.2-checkout/yamlh.go' -> `/tmp/guix-build-go-gopkg-in-yaml-v2-2.2.2.drv-0/src/gopkg.in/yaml.v2/yamlh.go'
`/gnu/store/iif7mdhbsisj7k213vv7f1n8x1krm0f5-go-gopkg-in-yaml-v2-2.2.2-checkout/sorter.go' -> `/tmp/guix-build-go-gopkg-in-yaml-v2-2.2.2.drv-0/src/gopkg.in/yaml.v2/sorter.go'
`/gnu/store/iif7mdhbsisj7k213vv7f1n8x1krm0f5-go-gopkg-in-yaml-v2-2.2.2-checkout/go.mod' -> `/tmp/guix-build-go-gopkg-in-yaml-v2-2.2.2.drv-0/src/gopkg.in/yaml.v2/go.mod'
`/gnu/store/iif7mdhbsisj7k213vv7f1n8x1krm0f5-go-gopkg-in-yaml-v2-2.2.2-checkout/yamlprivateh.go' -> `/tmp/guix-build-go-gopkg-in-yaml-v2-2.2.2.drv-0/src/gopkg.in/yaml.v2/yamlprivateh.go'
`/gnu/store/iif7mdhbsisj7k213vv7f1n8x1krm0f5-go-gopkg-in-yaml-v2-2.2.2-checkout/resolve.go' -> `/tmp/guix-build-go-gopkg-in-yaml-v2-2.2.2.drv-0/src/gopkg.in/yaml.v2/resolve.go'
`/gnu/store/iif7mdhbsisj7k213vv7f1n8x1krm0f5-go-gopkg-in-yaml-v2-2.2.2-checkout/apic.go' -> `/tmp/guix-build-go-gopkg-in-yaml-v2-2.2.2.drv-0/src/gopkg.in/yaml.v2/apic.go'
`/gnu/store/iif7mdhbsisj7k213vv7f1n8x1krm0f5-go-gopkg-in-yaml-v2-2.2.2-checkout/parserc.go' -> `/tmp/guix-build-go-gopkg-in-yaml-v2-2.2.2.drv-0/src/gopkg.in/yaml.v2/parserc.go'
`/gnu/store/iif7mdhbsisj7k213vv7f1n8x1krm0f5-go-gopkg-in-yaml-v2-2.2.2-checkout/decode_test.go' -> `/tmp/guix-build-go-gopkg-in-yaml-v2-2.2.2.drv-0/src/gopkg.in/yaml.v2/decode_test.go'
`/gnu/store/iif7mdhbsisj7k213vv7f1n8x1krm0f5-go-gopkg-in-yaml-v2-2.2.2-checkout/encode_test.go' -> `/tmp/guix-build-go-gopkg-in-yaml-v2-2.2.2.drv-0/src/gopkg.in/yaml.v2/encode_test.go'
`/gnu/store/iif7mdhbsisj7k213vv7f1n8x1krm0f5-go-gopkg-in-yaml-v2-2.2.2-checkout/.travis.yml' -> `/tmp/guix-build-go-gopkg-in-yaml-v2-2.2.2.drv-0/src/gopkg.in/yaml.v2/.travis.yml'
`/gnu/store/iif7mdhbsisj7k213vv7f1n8x1krm0f5-go-gopkg-in-yaml-v2-2.2.2-checkout/decode.go' -> `/tmp/guix-build-go-gopkg-in-yaml-v2-2.2.2.drv-0/src/gopkg.in/yaml.v2/decode.go'
`/gnu/store/iif7mdhbsisj7k213vv7f1n8x1krm0f5-go-gopkg-in-yaml-v2-2.2.2-checkout/emitterc.go' -> `/tmp/guix-build-go-gopkg-in-yaml-v2-2.2.2.drv-0/src/gopkg.in/yaml.v2/emitterc.go'
`/gnu/store/iif7mdhbsisj7k213vv7f1n8x1krm0f5-go-gopkg-in-yaml-v2-2.2.2-checkout/yaml.go' -> `/tmp/guix-build-go-gopkg-in-yaml-v2-2.2.2.drv-0/src/gopkg.in/yaml.v2/yaml.go'
`/gnu/store/iif7mdhbsisj7k213vv7f1n8x1krm0f5-go-gopkg-in-yaml-v2-2.2.2-checkout/readerc.go' -> `/tmp/guix-build-go-gopkg-in-yaml-v2-2.2.2.drv-0/src/gopkg.in/yaml.v2/readerc.go'
phase `unpack' succeeded after 0.2 seconds
starting phase `patch-usr-bin-file'
phase `patch-usr-bin-file' succeeded after 0.0 seconds
starting phase `patch-source-shebangs'
phase `patch-source-shebangs' succeeded after 0.0 seconds
starting phase `build'
WORK=/tmp/guix-build-go-gopkg-in-yaml-v2-2.2.2.drv-0/go-build799249603
gopkg.in/yaml.v2
mkdir -p $WORK/b001/
cat >$WORK/b001/importcfg << 'EOF' # internal
# import config
packagefile bytes=/gnu/store/ghvg7wa0m2dih1nibxja66m86q1ffm6w-go-1.14.15/pkg/linux_386/bytes.a
packagefile encoding=/gnu/store/ghvg7wa0m2dih1nibxja66m86q1ffm6w-go-1.14.15/pkg/linux_386/encoding.a
packagefile encoding/base64=/gnu/store/ghvg7wa0m2dih1nibxja66m86q1ffm6w-go-1.14.15/pkg/linux_386/encoding/base64.a
packagefile errors=/gnu/store/ghvg7wa0m2dih1nibxja66m86q1ffm6w-go-1.14.15/pkg/linux_386/errors.a
packagefile fmt=/gnu/store/ghvg7wa0m2dih1nibxja66m86q1ffm6w-go-1.14.15/pkg/linux_386/fmt.a
packagefile io=/gnu/store/ghvg7wa0m2dih1nibxja66m86q1ffm6w-go-1.14.15/pkg/linux_386/io.a
packagefile math=/gnu/store/ghvg7wa0m2dih1nibxja66m86q1ffm6w-go-1.14.15/pkg/linux_386/math.a
packagefile reflect=/gnu/store/ghvg7wa0m2dih1nibxja66m86q1ffm6w-go-1.14.15/pkg/linux_386/reflect.a
packagefile regexp=/gnu/store/ghvg7wa0m2dih1nibxja66m86q1ffm6w-go-1.14.15/pkg/linux_386/regexp.a
packagefile sort=/gnu/store/ghvg7wa0m2dih1nibxja66m86q1ffm6w-go-1.14.15/pkg/linux_386/sort.a
packagefile strconv=/gnu/store/ghvg7wa0m2dih1nibxja66m86q1ffm6w-go-1.14.15/pkg/linux_386/strconv.a
packagefile strings=/gnu/store/ghvg7wa0m2dih1nibxja66m86q1ffm6w-go-1.14.15/pkg/linux_386/strings.a
packagefile sync=/gnu/store/ghvg7wa0m2dih1nibxja66m86q1ffm6w-go-1.14.15/pkg/linux_386/sync.a
packagefile time=/gnu/store/ghvg7wa0m2dih1nibxja66m86q1ffm6w-go-1.14.15/pkg/linux_386/time.a
packagefile unicode=/gnu/store/ghvg7wa0m2dih1nibxja66m86q1ffm6w-go-1.14.15/pkg/linux_386/unicode.a
packagefile unicode/utf8=/gnu/store/ghvg7wa0m2dih1nibxja66m86q1ffm6w-go-1.14.15/pkg/linux_386/unicode/utf8.a
EOF
cd /tmp/guix-build-go-gopkg-in-yaml-v2-2.2.2.drv-0/src/gopkg.in/yaml.v2
/gnu/store/ghvg7wa0m2dih1nibxja66m86q1ffm6w-go-1.14.15/pkg/tool/linux_386/compile -o $WORK/b001/_pkg_.a -trimpath "$WORK/b001=>" -p gopkg.in/yaml.v2 -complete -buildid uoC6ecVlBPJLzJJXOI4f/uoC6ecVlBPJLzJJXOI4f -goversion go1.14.15 -D "" -importcfg $WORK/b001/importcfg -pack ./apic.go ./decode.go ./emitterc.go ./encode.go ./parserc.go ./readerc.go ./resolve.go ./scannerc.go ./sorter.go ./writerc.go ./yaml.go ./yamlh.go ./yamlprivateh.go
/gnu/store/ghvg7wa0m2dih1nibxja66m86q1ffm6w-go-1.14.15/pkg/tool/linux_386/buildid -w $WORK/b001/_pkg_.a # internal
cp $WORK/b001/_pkg_.a /tmp/go-cache/5c/5cf33d88b6e6025d9a8c233cb8fa400bd48d0f6b72e3dae335ed38e440159046-d # internal
mkdir -p /tmp/guix-build-go-gopkg-in-yaml-v2-2.2.2.drv-0/pkg/linux_386/gopkg.in/
mv $WORK/b001/_pkg_.a /tmp/guix-build-go-gopkg-in-yaml-v2-2.2.2.drv-0/pkg/linux_386/gopkg.in/yaml.v2.a
rm -r $WORK/b001/
phase `build' succeeded after 7.3 seconds
starting phase `check'
# gopkg.in/yaml.v2_test [gopkg.in/yaml.v2.test]
src/gopkg.in/yaml.v2/decode_test.go:134:26: constant -9223372036854775808 overflows int
FAIL	gopkg.in/yaml.v2 [build failed]
FAIL
command "go" "test" "gopkg.in/yaml.v2" failed with status 2

Some deprecated features have been used.  Set the environment
variable GUILE_WARN_DEPRECATED to "detailed" and rerun the
program to get more information.  Set it to "no" to suppress
this message.
```




^ permalink raw reply	[flat|nested] 7+ messages in thread

* bug#47928: go-gopkg-in-yaml-v2-2.2.2 build fails
  2021-04-21  1:46 bug#47928: go-gopkg-in-yaml-v2-2.2.2 build fails Bone Baboon via Bug reports for GNU Guix
@ 2021-04-26 15:17 ` raingloom
  2021-04-26 21:39   ` Bone Baboon via Bug reports for GNU Guix
  2021-04-30 22:28 ` Bone Baboon via Bug reports for GNU Guix
  2021-05-03  3:28 ` Bone Baboon via Bug reports for GNU Guix
  2 siblings, 1 reply; 7+ messages in thread
From: raingloom @ 2021-04-26 15:17 UTC (permalink / raw)
  To: 47928

On Tue, 20 Apr 2021 21:46:42 -0400
Bone Baboon via Bug reports for GNU Guix <bug-guix@gnu.org> wrote:

> On a i686 computer when I run `sudo guix system --no-substitutes
> --cores=1 --max-jobs=1 reconfigure config.scm` I get this error:
> 
> phase `check' # gopkg.in/yaml.v2_test [gopkg.in/yaml.v2.test]
> src/gopkg.in/yaml.v2/decode_test.go:134:26: constant
> -9223372036854775808 overflows int FAIL	gopkg.in/yaml.v2
> [build failed] FAIL command "go" "test" "gopkg.in/yaml.v2" failed
> with status 2
> 

My guess is that int is 32 bits on i686. If that's the case,
this sounds like an upstream bug. Have you reported it to them?




^ permalink raw reply	[flat|nested] 7+ messages in thread

* bug#47928: go-gopkg-in-yaml-v2-2.2.2 build fails
  2021-04-26 15:17 ` raingloom
@ 2021-04-26 21:39   ` Bone Baboon via Bug reports for GNU Guix
  2021-04-28  0:45     ` raingloom
  0 siblings, 1 reply; 7+ messages in thread
From: Bone Baboon via Bug reports for GNU Guix @ 2021-04-26 21:39 UTC (permalink / raw)
  To: raingloom; +Cc: 47928

raingloom writes:
> My guess is that int is 32 bits on i686.

The computer's CPU is 32 bit.

How would I check if "int is 32 bits on i686"?




^ permalink raw reply	[flat|nested] 7+ messages in thread

* bug#47928: go-gopkg-in-yaml-v2-2.2.2 build fails
  2021-04-26 21:39   ` Bone Baboon via Bug reports for GNU Guix
@ 2021-04-28  0:45     ` raingloom
  2021-04-30 22:21       ` Bone Baboon via Bug reports for GNU Guix
  0 siblings, 1 reply; 7+ messages in thread
From: raingloom @ 2021-04-28  0:45 UTC (permalink / raw)
  To: Bone Baboon; +Cc: 47928

On Mon, 26 Apr 2021 17:39:58 -0400
Bone Baboon <bone.baboon@disroot.org> wrote:

> raingloom writes:
> > My guess is that int is 32 bits on i686.  
> 
> The computer's CPU is 32 bit.
> 
> How would I check if "int is 32 bits on i686"?

Looking up an authoritative source (ie.: "the docs") is one way. Here
is what I found:

https://tour.golang.org/basics/11
 The int, uint, and uintptr types are usually 32 bits wide on 32-bit
 systems and 64 bits wide on 64-bit systems. When you need an integer
 value you should use int unless you have a specific reason to use a
 sized or unsigned integer type. 


Another would be to try to do an operation that would wrap around, but
if you aren't familiar with binary arithmetic in the language in
question, just looking it up is probably easier.




^ permalink raw reply	[flat|nested] 7+ messages in thread

* bug#47928: go-gopkg-in-yaml-v2-2.2.2 build fails
  2021-04-28  0:45     ` raingloom
@ 2021-04-30 22:21       ` Bone Baboon via Bug reports for GNU Guix
  0 siblings, 0 replies; 7+ messages in thread
From: Bone Baboon via Bug reports for GNU Guix @ 2021-04-30 22:21 UTC (permalink / raw)
  To: raingloom; +Cc: 47928

raingloom writes:

> On Mon, 26 Apr 2021 17:39:58 -0400
> Bone Baboon <bone.baboon@disroot.org> wrote:
>
>> raingloom writes:
>> > My guess is that int is 32 bits on i686.  
>> 
>> The computer's CPU is 32 bit.
>> 
>> How would I check if "int is 32 bits on i686"?
>
> Looking up an authoritative source (ie.: "the docs") is one way. Here
> is what I found:
>
> https://tour.golang.org/basics/11
>  The int, uint, and uintptr types are usually 32 bits wide on 32-bit
>  systems and 64 bits wide on 64-bit systems. When you need an integer
>  value you should use int unless you have a specific reason to use a
>  sized or unsigned integer type. 
>
>
> Another would be to try to do an operation that would wrap around, but
> if you aren't familiar with binary arithmetic in the language in
> question, just looking it up is probably easier.

Thank you for sharing this.




^ permalink raw reply	[flat|nested] 7+ messages in thread

* bug#47928: go-gopkg-in-yaml-v2-2.2.2 build fails
  2021-04-21  1:46 bug#47928: go-gopkg-in-yaml-v2-2.2.2 build fails Bone Baboon via Bug reports for GNU Guix
  2021-04-26 15:17 ` raingloom
@ 2021-04-30 22:28 ` Bone Baboon via Bug reports for GNU Guix
  2021-05-03  3:28 ` Bone Baboon via Bug reports for GNU Guix
  2 siblings, 0 replies; 7+ messages in thread
From: Bone Baboon via Bug reports for GNU Guix @ 2021-04-30 22:28 UTC (permalink / raw)
  To: 47928

I get the same error when I try `guix build --no-substitutes
--system=i686-linux go-gopkg-in-yaml-v2`.

Bone Baboon writes:

> On a i686 computer when I run `sudo guix system --no-substitutes --cores=1 --max-jobs=1 reconfigure config.scm` I get this error:
>
> ```
> building /gnu/store/yqwd4wbam8mx0n2idy1qj4861rzvra7n-go-gopkg-in-yaml-v2-2.2.2.drv...
> | 'check' phasebuilder for `/gnu/store/yqwd4wbam8mx0n2idy1qj4861rzvra7n-go-gopkg-in-yaml-v2-2.2.2.drv' failed with exit code 1
> build of /gnu/store/yqwd4wbam8mx0n2idy1qj4861rzvra7n-go-gopkg-in-yaml-v2-2.2.2.drv failed
> View build log at '/var/log/guix/drvs/yq/wd4wbam8mx0n2idy1qj4861rzvra7n-go-gopkg-in-yaml-v2-2.2.2.drv.bz2'.
> cannot build derivation `/gnu/store/qkinjq5fkp3vd70g6vcf3wwd66d0slq7-docker-libnetwork-cmd-proxy-19.03-1.55e924b.drv': 1 dependencies couldn't be built
> cannot build derivation `/gnu/store/6vi73j6gn3g3xdg30wp0kdmdg0nhxan6-gotestsum-0.4.0.drv': 1 dependencies couldn't be built
> cannot build derivation `/gnu/store/8s9kwwcg5wilqkl3mgysr0mg12dj10zq-docker-19.03.15.drv': 1 dependencies couldn't be built
> guix system: error: build of `/gnu/store/8s9kwwcg5wilqkl3mgysr0mg12dj10zq-docker-19.03.15.drv' failed
> ```
>
> `guix describe` outputs:
>
> ```
> Generation 7    Apr 20 2021 18:12:09    (current)
>   guix 0e21cf7
>     repository URL: https://git.savannah.gnu.org/git/guix.git
>     branch: master
>     commit: 0e21cf7d0620caf3fe9bed4f6ec1d5239a599a6a
> ```
>
> The build log contents:
>
> ```
> starting phase `set-SOURCE-DATE-EPOCH'
> phase `set-SOURCE-DATE-EPOCH' succeeded after 0.0 seconds
> starting phase `set-paths'
> environment variable `PATH' set to `/gnu/store/ghvg7wa0m2dih1nibxja66m86q1ffm6w-go-1.14.15/bin:/gnu/store/gww59gv5qxbfijg3vk5y182im7923s06-tar-1.32/bin:/gnu/store/2ayciqwxddkzq183dac82ijljc14j4zj-gzip-1.10/bin:/gnu/store/n1jk0w2wa4vpwmixaqn2y3la1l2sizzi-bzip2-1.0.8/bin:/gnu/store/7p36raqgk6vn47bflxc9bsclqiib3phi-xz-5.2.4/bin:/gnu/store/lpkf3ydcdvxn8gcrzaq9cp3ri05h8qhs-file-5.38/bin:/gnu/store/6gqaw09zqw8w0vcax6simlq71bq7l5r0-diffutils-3.7/bin:/gnu/store/qw20chpgkgbcqmzhs60c8hjl1hmblyc8-patch-2.7.6/bin:/gnu/store/b5y5scfmh2d8kxcpl9p84294z2198cgf-findutils-4.7.0/bin:/gnu/store/9iwlsj7d6ffqhshy8qshf7p4fqwfwrvn-gawk-5.0.1/bin:/gnu/store/q1nfjb24vqjs1cgi8mlnskw34h16y09r-sed-4.8/bin:/gnu/store/4qr6mcvsxyzknxa7x1wny8x30f5i0r3n-grep-3.4/bin:/gnu/store/2v61vg0bizgrhybkqbrki2k7kr094waz-coreutils-8.32/bin:/gnu/store/b7jbh7kzzig0bxfswdj8nfj9bkljyyya-make-4.3/bin:/gnu/store/v1g7f3p4f0851mywrla8qmr9hb8jgfjr-bash-minimal-5.0.16/bin:/gnu/store/dyqxnydqk1810afjfbqzfvh0n83xyl62-ld-wrapper-0/bin:/gnu/store/50lyzn9bz6x4da66648kry29wn8afird-binutils-2.34/bin:/gnu/store/afpgzln8860m6yfhxy6i8n9rywbp85cy-gcc-7.5.0/bin:/gnu/store/z4li262il798hbl0l1h1k3a5g7r6bffa-glibc-2.31/bin:/gnu/store/z4li262il798hbl0l1h1k3a5g7r6bffa-glibc-2.31/sbin'
> environment variable `BASH_LOADABLES_PATH' unset
> environment variable `C_INCLUDE_PATH' set to `/gnu/store/n1jk0w2wa4vpwmixaqn2y3la1l2sizzi-bzip2-1.0.8/include:/gnu/store/7p36raqgk6vn47bflxc9bsclqiib3phi-xz-5.2.4/include:/gnu/store/lpkf3ydcdvxn8gcrzaq9cp3ri05h8qhs-file-5.38/include:/gnu/store/9iwlsj7d6ffqhshy8qshf7p4fqwfwrvn-gawk-5.0.1/include:/gnu/store/b7jbh7kzzig0bxfswdj8nfj9bkljyyya-make-4.3/include:/gnu/store/50lyzn9bz6x4da66648kry29wn8afird-binutils-2.34/include:/gnu/store/afpgzln8860m6yfhxy6i8n9rywbp85cy-gcc-7.5.0/include:/gnu/store/z4li262il798hbl0l1h1k3a5g7r6bffa-glibc-2.31/include:/gnu/store/hk7l42fwxmnrnlhyiixvaqf1i1crcckp-linux-libre-headers-5.4.20/include'
> environment variable `CPLUS_INCLUDE_PATH' set to `/gnu/store/n1jk0w2wa4vpwmixaqn2y3la1l2sizzi-bzip2-1.0.8/include:/gnu/store/7p36raqgk6vn47bflxc9bsclqiib3phi-xz-5.2.4/include:/gnu/store/lpkf3ydcdvxn8gcrzaq9cp3ri05h8qhs-file-5.38/include:/gnu/store/9iwlsj7d6ffqhshy8qshf7p4fqwfwrvn-gawk-5.0.1/include:/gnu/store/b7jbh7kzzig0bxfswdj8nfj9bkljyyya-make-4.3/include:/gnu/store/50lyzn9bz6x4da66648kry29wn8afird-binutils-2.34/include:/gnu/store/afpgzln8860m6yfhxy6i8n9rywbp85cy-gcc-7.5.0/include/c++:/gnu/store/afpgzln8860m6yfhxy6i8n9rywbp85cy-gcc-7.5.0/include:/gnu/store/z4li262il798hbl0l1h1k3a5g7r6bffa-glibc-2.31/include:/gnu/store/hk7l42fwxmnrnlhyiixvaqf1i1crcckp-linux-libre-headers-5.4.20/include'
> environment variable `LIBRARY_PATH' set to `/gnu/store/ghvg7wa0m2dih1nibxja66m86q1ffm6w-go-1.14.15/lib:/gnu/store/n1jk0w2wa4vpwmixaqn2y3la1l2sizzi-bzip2-1.0.8/lib:/gnu/store/7p36raqgk6vn47bflxc9bsclqiib3phi-xz-5.2.4/lib:/gnu/store/lpkf3ydcdvxn8gcrzaq9cp3ri05h8qhs-file-5.38/lib:/gnu/store/9iwlsj7d6ffqhshy8qshf7p4fqwfwrvn-gawk-5.0.1/lib:/gnu/store/50lyzn9bz6x4da66648kry29wn8afird-binutils-2.34/lib:/gnu/store/z4li262il798hbl0l1h1k3a5g7r6bffa-glibc-2.31/lib:/gnu/store/rzk3v28mhi4m7sh0qippp9a5rzy03rkg-glibc-2.31-static/lib:/gnu/store/x6i3vfg4gaqd42cqb6mzk52v4lds1467-glibc-utf8-locales-2.31/lib'
> environment variable `GUIX_LOCPATH' set to `/gnu/store/x6i3vfg4gaqd42cqb6mzk52v4lds1467-glibc-utf8-locales-2.31/lib/locale'
> phase `set-paths' succeeded after 0.1 seconds
> starting phase `install-locale'
> using 'en_US.utf8' locale for category "LC_ALL"
> phase `install-locale' succeeded after 0.0 seconds
> starting phase `setup-go-environment'
> `/tmp/fileipQEjf/src/github.com/kr/text/indent.go' -> `/tmp/guix-build-go-gopkg-in-yaml-v2-2.2.2.drv-0/src/github.com/kr/text/indent.go'
> `/tmp/fileipQEjf/src/github.com/kr/text/indent_test.go' -> `/tmp/guix-build-go-gopkg-in-yaml-v2-2.2.2.drv-0/src/github.com/kr/text/indent_test.go'
> `/tmp/fileipQEjf/src/github.com/kr/text/wrap.go' -> `/tmp/guix-build-go-gopkg-in-yaml-v2-2.2.2.drv-0/src/github.com/kr/text/wrap.go'
> `/tmp/fileipQEjf/src/github.com/kr/text/wrap_test.go' -> `/tmp/guix-build-go-gopkg-in-yaml-v2-2.2.2.drv-0/src/github.com/kr/text/wrap_test.go'
> `/tmp/fileipQEjf/src/github.com/kr/text/doc.go' -> `/tmp/guix-build-go-gopkg-in-yaml-v2-2.2.2.drv-0/src/github.com/kr/text/doc.go'
> `/tmp/fileipQEjf/src/github.com/kr/text/go.mod' -> `/tmp/guix-build-go-gopkg-in-yaml-v2-2.2.2.drv-0/src/github.com/kr/text/go.mod'
> `/tmp/fileipQEjf/src/github.com/kr/text/License' -> `/tmp/guix-build-go-gopkg-in-yaml-v2-2.2.2.drv-0/src/github.com/kr/text/License'
> `/tmp/fileipQEjf/src/github.com/kr/text/Readme' -> `/tmp/guix-build-go-gopkg-in-yaml-v2-2.2.2.drv-0/src/github.com/kr/text/Readme'
> `/tmp/fileipQEjf/src/github.com/kr/text/cmd/agg/main.go' -> `/tmp/guix-build-go-gopkg-in-yaml-v2-2.2.2.drv-0/src/github.com/kr/text/cmd/agg/main.go'
> `/tmp/fileipQEjf/src/github.com/kr/text/cmd/agg/string.go' -> `/tmp/guix-build-go-gopkg-in-yaml-v2-2.2.2.drv-0/src/github.com/kr/text/cmd/agg/string.go'
> `/tmp/fileipQEjf/src/github.com/kr/text/cmd/agg/doc.go' -> `/tmp/guix-build-go-gopkg-in-yaml-v2-2.2.2.drv-0/src/github.com/kr/text/cmd/agg/doc.go'
> `/tmp/fileipQEjf/src/github.com/kr/text/cmd/agg/num.go' -> `/tmp/guix-build-go-gopkg-in-yaml-v2-2.2.2.drv-0/src/github.com/kr/text/cmd/agg/num.go'
> `/tmp/fileipQEjf/src/github.com/kr/text/mc/mc.go' -> `/tmp/guix-build-go-gopkg-in-yaml-v2-2.2.2.drv-0/src/github.com/kr/text/mc/mc.go'
> `/tmp/fileipQEjf/src/github.com/kr/text/mc/Readme' -> `/tmp/guix-build-go-gopkg-in-yaml-v2-2.2.2.drv-0/src/github.com/kr/text/mc/Readme'
> `/tmp/fileipQEjf/src/github.com/kr/text/colwriter/column.go' -> `/tmp/guix-build-go-gopkg-in-yaml-v2-2.2.2.drv-0/src/github.com/kr/text/colwriter/column.go'
> `/tmp/fileipQEjf/src/github.com/kr/text/colwriter/column_test.go' -> `/tmp/guix-build-go-gopkg-in-yaml-v2-2.2.2.drv-0/src/github.com/kr/text/colwriter/column_test.go'
> `/tmp/fileipQEjf/src/github.com/kr/text/colwriter/Readme' -> `/tmp/guix-build-go-gopkg-in-yaml-v2-2.2.2.drv-0/src/github.com/kr/text/colwriter/Readme'
> `/tmp/fileipQEjf/src/github.com/kr/pretty/example_test.go' -> `/tmp/guix-build-go-gopkg-in-yaml-v2-2.2.2.drv-0/src/github.com/kr/pretty/example_test.go'
> `/tmp/fileipQEjf/src/github.com/kr/pretty/formatter_test.go' -> `/tmp/guix-build-go-gopkg-in-yaml-v2-2.2.2.drv-0/src/github.com/kr/pretty/formatter_test.go'
> `/tmp/fileipQEjf/src/github.com/kr/pretty/formatter.go' -> `/tmp/guix-build-go-gopkg-in-yaml-v2-2.2.2.drv-0/src/github.com/kr/pretty/formatter.go'
> `/tmp/fileipQEjf/src/github.com/kr/pretty/diff.go' -> `/tmp/guix-build-go-gopkg-in-yaml-v2-2.2.2.drv-0/src/github.com/kr/pretty/diff.go'
> `/tmp/fileipQEjf/src/github.com/kr/pretty/go.mod' -> `/tmp/guix-build-go-gopkg-in-yaml-v2-2.2.2.drv-0/src/github.com/kr/pretty/go.mod'
> `/tmp/fileipQEjf/src/github.com/kr/pretty/zero.go' -> `/tmp/guix-build-go-gopkg-in-yaml-v2-2.2.2.drv-0/src/github.com/kr/pretty/zero.go'
> `/tmp/fileipQEjf/src/github.com/kr/pretty/License' -> `/tmp/guix-build-go-gopkg-in-yaml-v2-2.2.2.drv-0/src/github.com/kr/pretty/License'
> `/tmp/fileipQEjf/src/github.com/kr/pretty/diff_test.go' -> `/tmp/guix-build-go-gopkg-in-yaml-v2-2.2.2.drv-0/src/github.com/kr/pretty/diff_test.go'
> `/tmp/fileipQEjf/src/github.com/kr/pretty/go.sum' -> `/tmp/guix-build-go-gopkg-in-yaml-v2-2.2.2.drv-0/src/github.com/kr/pretty/go.sum'
> `/tmp/fileipQEjf/src/github.com/kr/pretty/pretty.go' -> `/tmp/guix-build-go-gopkg-in-yaml-v2-2.2.2.drv-0/src/github.com/kr/pretty/pretty.go'
> `/tmp/fileipQEjf/src/github.com/kr/pretty/.gitignore' -> `/tmp/guix-build-go-gopkg-in-yaml-v2-2.2.2.drv-0/src/github.com/kr/pretty/.gitignore'
> `/tmp/fileipQEjf/src/github.com/kr/pretty/Readme' -> `/tmp/guix-build-go-gopkg-in-yaml-v2-2.2.2.drv-0/src/github.com/kr/pretty/Readme'
> `/tmp/fileipQEjf/src/gopkg.in/check.v1/benchmark.go' -> `/tmp/guix-build-go-gopkg-in-yaml-v2-2.2.2.drv-0/src/gopkg.in/check.v1/benchmark.go'
> `/tmp/fileipQEjf/src/gopkg.in/check.v1/helpers_test.go' -> `/tmp/guix-build-go-gopkg-in-yaml-v2-2.2.2.drv-0/src/gopkg.in/check.v1/helpers_test.go'
> `/tmp/fileipQEjf/src/gopkg.in/check.v1/bootstrap_test.go' -> `/tmp/guix-build-go-gopkg-in-yaml-v2-2.2.2.drv-0/src/gopkg.in/check.v1/bootstrap_test.go'
> `/tmp/fileipQEjf/src/gopkg.in/check.v1/check_test.go' -> `/tmp/guix-build-go-gopkg-in-yaml-v2-2.2.2.drv-0/src/gopkg.in/check.v1/check_test.go'
> `/tmp/fileipQEjf/src/gopkg.in/check.v1/README.md' -> `/tmp/guix-build-go-gopkg-in-yaml-v2-2.2.2.drv-0/src/gopkg.in/check.v1/README.md'
> `/tmp/fileipQEjf/src/gopkg.in/check.v1/foundation_test.go' -> `/tmp/guix-build-go-gopkg-in-yaml-v2-2.2.2.drv-0/src/gopkg.in/check.v1/foundation_test.go'
> `/tmp/fileipQEjf/src/gopkg.in/check.v1/run.go' -> `/tmp/guix-build-go-gopkg-in-yaml-v2-2.2.2.drv-0/src/gopkg.in/check.v1/run.go'
> `/tmp/fileipQEjf/src/gopkg.in/check.v1/reporter.go' -> `/tmp/guix-build-go-gopkg-in-yaml-v2-2.2.2.drv-0/src/gopkg.in/check.v1/reporter.go'
> `/tmp/fileipQEjf/src/gopkg.in/check.v1/checkers_test.go' -> `/tmp/guix-build-go-gopkg-in-yaml-v2-2.2.2.drv-0/src/gopkg.in/check.v1/checkers_test.go'
> `/tmp/fileipQEjf/src/gopkg.in/check.v1/LICENSE' -> `/tmp/guix-build-go-gopkg-in-yaml-v2-2.2.2.drv-0/src/gopkg.in/check.v1/LICENSE'
> `/tmp/fileipQEjf/src/gopkg.in/check.v1/TODO' -> `/tmp/guix-build-go-gopkg-in-yaml-v2-2.2.2.drv-0/src/gopkg.in/check.v1/TODO'
> `/tmp/fileipQEjf/src/gopkg.in/check.v1/checkers.go' -> `/tmp/guix-build-go-gopkg-in-yaml-v2-2.2.2.drv-0/src/gopkg.in/check.v1/checkers.go'
> `/tmp/fileipQEjf/src/gopkg.in/check.v1/reporter_test.go' -> `/tmp/guix-build-go-gopkg-in-yaml-v2-2.2.2.drv-0/src/gopkg.in/check.v1/reporter_test.go'
> `/tmp/fileipQEjf/src/gopkg.in/check.v1/.travis.yml' -> `/tmp/guix-build-go-gopkg-in-yaml-v2-2.2.2.drv-0/src/gopkg.in/check.v1/.travis.yml'
> `/tmp/fileipQEjf/src/gopkg.in/check.v1/export_test.go' -> `/tmp/guix-build-go-gopkg-in-yaml-v2-2.2.2.drv-0/src/gopkg.in/check.v1/export_test.go'
> `/tmp/fileipQEjf/src/gopkg.in/check.v1/run_test.go' -> `/tmp/guix-build-go-gopkg-in-yaml-v2-2.2.2.drv-0/src/gopkg.in/check.v1/run_test.go'
> `/tmp/fileipQEjf/src/gopkg.in/check.v1/fixture_test.go' -> `/tmp/guix-build-go-gopkg-in-yaml-v2-2.2.2.drv-0/src/gopkg.in/check.v1/fixture_test.go'
> `/tmp/fileipQEjf/src/gopkg.in/check.v1/benchmark_test.go' -> `/tmp/guix-build-go-gopkg-in-yaml-v2-2.2.2.drv-0/src/gopkg.in/check.v1/benchmark_test.go'
> `/tmp/fileipQEjf/src/gopkg.in/check.v1/helpers.go' -> `/tmp/guix-build-go-gopkg-in-yaml-v2-2.2.2.drv-0/src/gopkg.in/check.v1/helpers.go'
> `/tmp/fileipQEjf/src/gopkg.in/check.v1/.gitignore' -> `/tmp/guix-build-go-gopkg-in-yaml-v2-2.2.2.drv-0/src/gopkg.in/check.v1/.gitignore'
> `/tmp/fileipQEjf/src/gopkg.in/check.v1/printer_test.go' -> `/tmp/guix-build-go-gopkg-in-yaml-v2-2.2.2.drv-0/src/gopkg.in/check.v1/printer_test.go'
> `/tmp/fileipQEjf/src/gopkg.in/check.v1/printer.go' -> `/tmp/guix-build-go-gopkg-in-yaml-v2-2.2.2.drv-0/src/gopkg.in/check.v1/printer.go'
> `/tmp/fileipQEjf/src/gopkg.in/check.v1/check.go' -> `/tmp/guix-build-go-gopkg-in-yaml-v2-2.2.2.drv-0/src/gopkg.in/check.v1/check.go'
> `/tmp/fileipQEjf/src/gopkg.in/check.v1/integration_test.go' -> `/tmp/guix-build-go-gopkg-in-yaml-v2-2.2.2.drv-0/src/gopkg.in/check.v1/integration_test.go'
> `/tmp/fileipQEjf/share/doc/go-github-com-kr-pretty-0.2.1/License' -> `/tmp/guix-build-go-gopkg-in-yaml-v2-2.2.2.drv-0/share/doc/go-github-com-kr-pretty-0.2.1/License'
> `/tmp/fileipQEjf/share/doc/go-gopkg-in-check-v1-1.0.0-1.788fd78/LICENSE' -> `/tmp/guix-build-go-gopkg-in-yaml-v2-2.2.2.drv-0/share/doc/go-gopkg-in-check-v1-1.0.0-1.788fd78/LICENSE'
> `/tmp/fileipQEjf/share/doc/go-github-com-kr-text-0.1.0/License' -> `/tmp/guix-build-go-gopkg-in-yaml-v2-2.2.2.drv-0/share/doc/go-github-com-kr-text-0.1.0/License'
> phase `setup-go-environment' succeeded after 0.2 seconds
> starting phase `unpack'
> `/gnu/store/iif7mdhbsisj7k213vv7f1n8x1krm0f5-go-gopkg-in-yaml-v2-2.2.2-checkout/writerc.go' -> `/tmp/guix-build-go-gopkg-in-yaml-v2-2.2.2.drv-0/src/gopkg.in/yaml.v2/writerc.go'
> `/gnu/store/iif7mdhbsisj7k213vv7f1n8x1krm0f5-go-gopkg-in-yaml-v2-2.2.2-checkout/encode.go' -> `/tmp/guix-build-go-gopkg-in-yaml-v2-2.2.2.drv-0/src/gopkg.in/yaml.v2/encode.go'
> `/gnu/store/iif7mdhbsisj7k213vv7f1n8x1krm0f5-go-gopkg-in-yaml-v2-2.2.2-checkout/suite_test.go' -> `/tmp/guix-build-go-gopkg-in-yaml-v2-2.2.2.drv-0/src/gopkg.in/yaml.v2/suite_test.go'
> `/gnu/store/iif7mdhbsisj7k213vv7f1n8x1krm0f5-go-gopkg-in-yaml-v2-2.2.2-checkout/NOTICE' -> `/tmp/guix-build-go-gopkg-in-yaml-v2-2.2.2.drv-0/src/gopkg.in/yaml.v2/NOTICE'
> `/gnu/store/iif7mdhbsisj7k213vv7f1n8x1krm0f5-go-gopkg-in-yaml-v2-2.2.2-checkout/README.md' -> `/tmp/guix-build-go-gopkg-in-yaml-v2-2.2.2.drv-0/src/gopkg.in/yaml.v2/README.md'
> `/gnu/store/iif7mdhbsisj7k213vv7f1n8x1krm0f5-go-gopkg-in-yaml-v2-2.2.2-checkout/LICENSE.libyaml' -> `/tmp/guix-build-go-gopkg-in-yaml-v2-2.2.2.drv-0/src/gopkg.in/yaml.v2/LICENSE.libyaml'
> `/gnu/store/iif7mdhbsisj7k213vv7f1n8x1krm0f5-go-gopkg-in-yaml-v2-2.2.2-checkout/example_embedded_test.go' -> `/tmp/guix-build-go-gopkg-in-yaml-v2-2.2.2.drv-0/src/gopkg.in/yaml.v2/example_embedded_test.go'
> `/gnu/store/iif7mdhbsisj7k213vv7f1n8x1krm0f5-go-gopkg-in-yaml-v2-2.2.2-checkout/scannerc.go' -> `/tmp/guix-build-go-gopkg-in-yaml-v2-2.2.2.drv-0/src/gopkg.in/yaml.v2/scannerc.go'
> `/gnu/store/iif7mdhbsisj7k213vv7f1n8x1krm0f5-go-gopkg-in-yaml-v2-2.2.2-checkout/LICENSE' -> `/tmp/guix-build-go-gopkg-in-yaml-v2-2.2.2.drv-0/src/gopkg.in/yaml.v2/LICENSE'
> `/gnu/store/iif7mdhbsisj7k213vv7f1n8x1krm0f5-go-gopkg-in-yaml-v2-2.2.2-checkout/yamlh.go' -> `/tmp/guix-build-go-gopkg-in-yaml-v2-2.2.2.drv-0/src/gopkg.in/yaml.v2/yamlh.go'
> `/gnu/store/iif7mdhbsisj7k213vv7f1n8x1krm0f5-go-gopkg-in-yaml-v2-2.2.2-checkout/sorter.go' -> `/tmp/guix-build-go-gopkg-in-yaml-v2-2.2.2.drv-0/src/gopkg.in/yaml.v2/sorter.go'
> `/gnu/store/iif7mdhbsisj7k213vv7f1n8x1krm0f5-go-gopkg-in-yaml-v2-2.2.2-checkout/go.mod' -> `/tmp/guix-build-go-gopkg-in-yaml-v2-2.2.2.drv-0/src/gopkg.in/yaml.v2/go.mod'
> `/gnu/store/iif7mdhbsisj7k213vv7f1n8x1krm0f5-go-gopkg-in-yaml-v2-2.2.2-checkout/yamlprivateh.go' -> `/tmp/guix-build-go-gopkg-in-yaml-v2-2.2.2.drv-0/src/gopkg.in/yaml.v2/yamlprivateh.go'
> `/gnu/store/iif7mdhbsisj7k213vv7f1n8x1krm0f5-go-gopkg-in-yaml-v2-2.2.2-checkout/resolve.go' -> `/tmp/guix-build-go-gopkg-in-yaml-v2-2.2.2.drv-0/src/gopkg.in/yaml.v2/resolve.go'
> `/gnu/store/iif7mdhbsisj7k213vv7f1n8x1krm0f5-go-gopkg-in-yaml-v2-2.2.2-checkout/apic.go' -> `/tmp/guix-build-go-gopkg-in-yaml-v2-2.2.2.drv-0/src/gopkg.in/yaml.v2/apic.go'
> `/gnu/store/iif7mdhbsisj7k213vv7f1n8x1krm0f5-go-gopkg-in-yaml-v2-2.2.2-checkout/parserc.go' -> `/tmp/guix-build-go-gopkg-in-yaml-v2-2.2.2.drv-0/src/gopkg.in/yaml.v2/parserc.go'
> `/gnu/store/iif7mdhbsisj7k213vv7f1n8x1krm0f5-go-gopkg-in-yaml-v2-2.2.2-checkout/decode_test.go' -> `/tmp/guix-build-go-gopkg-in-yaml-v2-2.2.2.drv-0/src/gopkg.in/yaml.v2/decode_test.go'
> `/gnu/store/iif7mdhbsisj7k213vv7f1n8x1krm0f5-go-gopkg-in-yaml-v2-2.2.2-checkout/encode_test.go' -> `/tmp/guix-build-go-gopkg-in-yaml-v2-2.2.2.drv-0/src/gopkg.in/yaml.v2/encode_test.go'
> `/gnu/store/iif7mdhbsisj7k213vv7f1n8x1krm0f5-go-gopkg-in-yaml-v2-2.2.2-checkout/.travis.yml' -> `/tmp/guix-build-go-gopkg-in-yaml-v2-2.2.2.drv-0/src/gopkg.in/yaml.v2/.travis.yml'
> `/gnu/store/iif7mdhbsisj7k213vv7f1n8x1krm0f5-go-gopkg-in-yaml-v2-2.2.2-checkout/decode.go' -> `/tmp/guix-build-go-gopkg-in-yaml-v2-2.2.2.drv-0/src/gopkg.in/yaml.v2/decode.go'
> `/gnu/store/iif7mdhbsisj7k213vv7f1n8x1krm0f5-go-gopkg-in-yaml-v2-2.2.2-checkout/emitterc.go' -> `/tmp/guix-build-go-gopkg-in-yaml-v2-2.2.2.drv-0/src/gopkg.in/yaml.v2/emitterc.go'
> `/gnu/store/iif7mdhbsisj7k213vv7f1n8x1krm0f5-go-gopkg-in-yaml-v2-2.2.2-checkout/yaml.go' -> `/tmp/guix-build-go-gopkg-in-yaml-v2-2.2.2.drv-0/src/gopkg.in/yaml.v2/yaml.go'
> `/gnu/store/iif7mdhbsisj7k213vv7f1n8x1krm0f5-go-gopkg-in-yaml-v2-2.2.2-checkout/readerc.go' -> `/tmp/guix-build-go-gopkg-in-yaml-v2-2.2.2.drv-0/src/gopkg.in/yaml.v2/readerc.go'
> phase `unpack' succeeded after 0.2 seconds
> starting phase `patch-usr-bin-file'
> phase `patch-usr-bin-file' succeeded after 0.0 seconds
> starting phase `patch-source-shebangs'
> phase `patch-source-shebangs' succeeded after 0.0 seconds
> starting phase `build'
> WORK=/tmp/guix-build-go-gopkg-in-yaml-v2-2.2.2.drv-0/go-build799249603
> gopkg.in/yaml.v2
> mkdir -p $WORK/b001/
> cat >$WORK/b001/importcfg << 'EOF' # internal
> # import config
> packagefile bytes=/gnu/store/ghvg7wa0m2dih1nibxja66m86q1ffm6w-go-1.14.15/pkg/linux_386/bytes.a
> packagefile encoding=/gnu/store/ghvg7wa0m2dih1nibxja66m86q1ffm6w-go-1.14.15/pkg/linux_386/encoding.a
> packagefile encoding/base64=/gnu/store/ghvg7wa0m2dih1nibxja66m86q1ffm6w-go-1.14.15/pkg/linux_386/encoding/base64.a
> packagefile errors=/gnu/store/ghvg7wa0m2dih1nibxja66m86q1ffm6w-go-1.14.15/pkg/linux_386/errors.a
> packagefile fmt=/gnu/store/ghvg7wa0m2dih1nibxja66m86q1ffm6w-go-1.14.15/pkg/linux_386/fmt.a
> packagefile io=/gnu/store/ghvg7wa0m2dih1nibxja66m86q1ffm6w-go-1.14.15/pkg/linux_386/io.a
> packagefile math=/gnu/store/ghvg7wa0m2dih1nibxja66m86q1ffm6w-go-1.14.15/pkg/linux_386/math.a
> packagefile reflect=/gnu/store/ghvg7wa0m2dih1nibxja66m86q1ffm6w-go-1.14.15/pkg/linux_386/reflect.a
> packagefile regexp=/gnu/store/ghvg7wa0m2dih1nibxja66m86q1ffm6w-go-1.14.15/pkg/linux_386/regexp.a
> packagefile sort=/gnu/store/ghvg7wa0m2dih1nibxja66m86q1ffm6w-go-1.14.15/pkg/linux_386/sort.a
> packagefile strconv=/gnu/store/ghvg7wa0m2dih1nibxja66m86q1ffm6w-go-1.14.15/pkg/linux_386/strconv.a
> packagefile strings=/gnu/store/ghvg7wa0m2dih1nibxja66m86q1ffm6w-go-1.14.15/pkg/linux_386/strings.a
> packagefile sync=/gnu/store/ghvg7wa0m2dih1nibxja66m86q1ffm6w-go-1.14.15/pkg/linux_386/sync.a
> packagefile time=/gnu/store/ghvg7wa0m2dih1nibxja66m86q1ffm6w-go-1.14.15/pkg/linux_386/time.a
> packagefile unicode=/gnu/store/ghvg7wa0m2dih1nibxja66m86q1ffm6w-go-1.14.15/pkg/linux_386/unicode.a
> packagefile unicode/utf8=/gnu/store/ghvg7wa0m2dih1nibxja66m86q1ffm6w-go-1.14.15/pkg/linux_386/unicode/utf8.a
> EOF
> cd /tmp/guix-build-go-gopkg-in-yaml-v2-2.2.2.drv-0/src/gopkg.in/yaml.v2
> /gnu/store/ghvg7wa0m2dih1nibxja66m86q1ffm6w-go-1.14.15/pkg/tool/linux_386/compile -o $WORK/b001/_pkg_.a -trimpath "$WORK/b001=>" -p gopkg.in/yaml.v2 -complete -buildid uoC6ecVlBPJLzJJXOI4f/uoC6ecVlBPJLzJJXOI4f -goversion go1.14.15 -D "" -importcfg $WORK/b001/importcfg -pack ./apic.go ./decode.go ./emitterc.go ./encode.go ./parserc.go ./readerc.go ./resolve.go ./scannerc.go ./sorter.go ./writerc.go ./yaml.go ./yamlh.go ./yamlprivateh.go
> /gnu/store/ghvg7wa0m2dih1nibxja66m86q1ffm6w-go-1.14.15/pkg/tool/linux_386/buildid -w $WORK/b001/_pkg_.a # internal
> cp $WORK/b001/_pkg_.a /tmp/go-cache/5c/5cf33d88b6e6025d9a8c233cb8fa400bd48d0f6b72e3dae335ed38e440159046-d # internal
> mkdir -p /tmp/guix-build-go-gopkg-in-yaml-v2-2.2.2.drv-0/pkg/linux_386/gopkg.in/
> mv $WORK/b001/_pkg_.a /tmp/guix-build-go-gopkg-in-yaml-v2-2.2.2.drv-0/pkg/linux_386/gopkg.in/yaml.v2.a
> rm -r $WORK/b001/
> phase `build' succeeded after 7.3 seconds
> starting phase `check'
> # gopkg.in/yaml.v2_test [gopkg.in/yaml.v2.test]
> src/gopkg.in/yaml.v2/decode_test.go:134:26: constant -9223372036854775808 overflows int
> FAIL	gopkg.in/yaml.v2 [build failed]
> FAIL
> command "go" "test" "gopkg.in/yaml.v2" failed with status 2
>
> Some deprecated features have been used.  Set the environment
> variable GUILE_WARN_DEPRECATED to "detailed" and rerun the
> program to get more information.  Set it to "no" to suppress
> this message.
> ```





^ permalink raw reply	[flat|nested] 7+ messages in thread

* bug#47928: go-gopkg-in-yaml-v2-2.2.2 build fails
  2021-04-21  1:46 bug#47928: go-gopkg-in-yaml-v2-2.2.2 build fails Bone Baboon via Bug reports for GNU Guix
  2021-04-26 15:17 ` raingloom
  2021-04-30 22:28 ` Bone Baboon via Bug reports for GNU Guix
@ 2021-05-03  3:28 ` Bone Baboon via Bug reports for GNU Guix
  2 siblings, 0 replies; 7+ messages in thread
From: Bone Baboon via Bug reports for GNU Guix @ 2021-05-03  3:28 UTC (permalink / raw)
  To: 47928

[-- Attachment #1: Type: text/plain, Size: 1472 bytes --]

go-gopkg-in-yaml-v2 is a dependency for Docker and I am not able to
build it on x86_64 or i686.

On a x86-64 computer when I run `sudo guix system --no-substitutes reconfigure configuration.scm` I get this error.

```
building /gnu/store/r1qnl1sk16vmi4h9l43hdiyw7pqylmyk-go-gopkg-in-yaml-v2-2.2.2.drv...
/ 'check' phasebuilder for `/gnu/store/r1qnl1sk16vmi4h9l43hdiyw7pqylmyk-go-gopkg-in-yaml-v2-2.2.2.drv' failed with exit code 1
build of /gnu/store/r1qnl1sk16vmi4h9l43hdiyw7pqylmyk-go-gopkg-in-yaml-v2-2.2.2.drv failed
View build log at '/var/log/guix/drvs/r1/qnl1sk16vmi4h9l43hdiyw7pqylmyk-go-gopkg-in-yaml-v2-2.2.2.drv.bz2'.
cannot build derivation `/gnu/store/0x15knikz54rhrk7f0b1bm7hzrc68008-docker-libnetwork-cmd-proxy-19.03-1.55e924b.drv': 1 dependencies couldn't be built
building /gnu/store/93ygd3b4jjxbwg09czya0mqdzaa9pyar-elogind-243.7.drv...
cannot build derivation `/gnu/store/3wwm05nf6wwdyapzln5ad1hajkzhj2z1-gotestsum-0.4.0.drv': 1 dependencies couldn't be built
cannot build derivation `/gnu/store/kz0vqbylk9rl7cfm5m69ggs07njb6cx8-docker-19.03.15.drv': 1 dependencies couldn't be built
guix system: error: build of `/gnu/store/kz0vqbylk9rl7cfm5m69ggs07njb6cx8-docker-19.03.15.drv' failed
```

`guix describe` outputs:

```
Generation 17   May 02 2021 17:29:04    (current)
  guix 065d2cd
    repository URL: https://git.savannah.gnu.org/git/guix.git
    branch: master
    commit: 065d2cd6ced96ddb38c15a46f798488f61660a33
```

The build log is attached.


[-- Attachment #2: build-log.lz --]
[-- Type: application/octet-stream, Size: 2819 bytes --]

[-- Attachment #3: Type: text/plain, Size: 1097 bytes --]


Bone Baboon writes:

> On a i686 computer when I run `sudo guix system --no-substitutes --cores=1 --max-jobs=1 reconfigure config.scm` I get this error:
>
> ```
> building /gnu/store/yqwd4wbam8mx0n2idy1qj4861rzvra7n-go-gopkg-in-yaml-v2-2.2.2.drv...
> | 'check' phasebuilder for `/gnu/store/yqwd4wbam8mx0n2idy1qj4861rzvra7n-go-gopkg-in-yaml-v2-2.2.2.drv' failed with exit code 1
> build of /gnu/store/yqwd4wbam8mx0n2idy1qj4861rzvra7n-go-gopkg-in-yaml-v2-2.2.2.drv failed
> View build log at '/var/log/guix/drvs/yq/wd4wbam8mx0n2idy1qj4861rzvra7n-go-gopkg-in-yaml-v2-2.2.2.drv.bz2'.
> cannot build derivation `/gnu/store/qkinjq5fkp3vd70g6vcf3wwd66d0slq7-docker-libnetwork-cmd-proxy-19.03-1.55e924b.drv': 1 dependencies couldn't be built
> cannot build derivation `/gnu/store/6vi73j6gn3g3xdg30wp0kdmdg0nhxan6-gotestsum-0.4.0.drv': 1 dependencies couldn't be built
> cannot build derivation `/gnu/store/8s9kwwcg5wilqkl3mgysr0mg12dj10zq-docker-19.03.15.drv': 1 dependencies couldn't be built
> guix system: error: build of `/gnu/store/8s9kwwcg5wilqkl3mgysr0mg12dj10zq-docker-19.03.15.drv' failed
> ```

^ permalink raw reply	[flat|nested] 7+ messages in thread

end of thread, other threads:[~2021-05-03  3:31 UTC | newest]

Thread overview: 7+ messages (download: mbox.gz / follow: Atom feed)
-- links below jump to the message on this page --
2021-04-21  1:46 bug#47928: go-gopkg-in-yaml-v2-2.2.2 build fails Bone Baboon via Bug reports for GNU Guix
2021-04-26 15:17 ` raingloom
2021-04-26 21:39   ` Bone Baboon via Bug reports for GNU Guix
2021-04-28  0:45     ` raingloom
2021-04-30 22:21       ` Bone Baboon via Bug reports for GNU Guix
2021-04-30 22:28 ` Bone Baboon via Bug reports for GNU Guix
2021-05-03  3:28 ` Bone Baboon via Bug reports for GNU Guix

unofficial mirror of bug-guix@gnu.org 

This inbox may be cloned and mirrored by anyone:

	git clone --mirror https://yhetil.org/guix-bugs/0 guix-bugs/git/0.git

	# If you have public-inbox 1.1+ installed, you may
	# initialize and index your mirror using the following commands:
	public-inbox-init -V2 guix-bugs guix-bugs/ https://yhetil.org/guix-bugs \
		bug-guix@gnu.org
	public-inbox-index guix-bugs

Example config snippet for mirrors.
Newsgroups are available over NNTP:
	nntp://news.yhetil.org/yhetil.gnu.guix.bugs
	nntp://news.gmane.io/gmane.comp.gnu.guix.bugs


AGPL code for this site: git clone http://ou63pmih66umazou.onion/public-inbox.git