unofficial mirror of bug-guix@gnu.org 
 help / color / Atom feed
* bug#42005: guix pull has been failed
@ 2020-06-22 10:31 Igor Gajsin
  2020-06-22 17:03 ` Marius Bakke
  0 siblings, 1 reply; 4+ messages in thread
From: Igor Gajsin @ 2020-06-22 10:31 UTC (permalink / raw)
  To: 42005

Hi Guix,

I found something when run `guix pull`. See the listing below for
details. Feel free to ask if I can provide more data.

@ build-log 2969932 44
make[1]: /bin/sh: No such file or directory
@ build-log 2969932 59
make[1]: *** [Makefile:201: check-macro-version] Error 127
@ build-log 2969932 76
make[1]: Leaving directory '/tmp/guix-build-flex-2.6.4.drv-0/flex-2.6.4/po'
@ build-log 2969932 48
make: *** [Makefile:533: all-recursive] Error 1
@ build-log 2969932 45
command "make" "-j" "8" failed with status 2
builder for `/gnu/store/k34nshsbn46hsml399a5dj9r38xmi5kv-flex-2.6.4.drv' failed with exit code 1
@ build-failed /gnu/store/k34nshsbn46hsml399a5dj9r38xmi5kv-flex-2.6.4.drv - 1 builder for `/gnu/store/k34nshsbn46hsml399a5dj9r38xmi5kv-flex-2.6.4.drv' failed with exit code 1
cannot build derivation `/gnu/store/qb2x5l2aw2ndwwz32jch8z0xjh3pr36y-bison-3.5.3.drv': 1 dependencies couldn't be built
@ build-started /gnu/store/j83dmswrp504r7lwjjmp4357z1f74x8z-gettext-0.20.1.tar.gz.drv - x86_64-linux /var/log/guix/drvs/j8//3dmswrp504r7lwjjmp4357z1f74x8z-gettext-0.20.1.tar.gz.drv.bz2 2975066
cannot build derivation `/gnu/store/1jy5vj7q1q959v31348bhxwc8i042h0w-groff-1.22.4.drv': 1 dependencies couldn't be built
cannot build derivation `/gnu/store/ynb4vsf1wbx58b2rlx5w906b89xxngxg-openldap-2.4.50.drv': 1 dependencies couldn't be built
Backtrace:
          11 (primitive-load "/gnu/store/2xigmdp2jm9qj0mdrxdzjx7gjckbi9xk-compute-guix-derivation")
In ice-9/eval.scm:
    155:9 10 (_ _)
    159:9  9 (_ #(#(#(#(#(#(#(#(#(#(#(#(#(#<directory (guile-user) 8f6140> (# ?)) #) ?) ?) #) ?) #) ?) #) #) #) #) #))
In ./guix/store.scm:
  2025:24  8 (run-with-store #<store-connection 256.99 790120> _ #:guile-for-build _ #:system _ #:target _)
   1859:8  7 (_ _)
In ./guix/gexp.scm:
   243:18  6 (_ _)
   1061:2  5 (_ _)
    921:2  4 (_ _)
    782:4  3 (_ _)
In ./guix/store.scm:
  1907:12  2 (_ #<store-connection 256.99 790120>)
   1356:5  1 (map/accumulate-builds #<store-connection 256.99 790120> _ _)
  1367:15  0 (_ #<store-connection 256.99 790120> _ _)

./guix/store.scm:1367:15: Throw to key `srfi-34' with args `(#<condition &store-protocol-error [message: "build of `/gnu/store/ynb4vsf1wbx58b2rlx5w906b89xxngxg-openldap-2.4.50.drv' failed" status: 100] 1541ce10>)'.
guix pull: error: You found a bug: the program '/gnu/store/2xigmdp2jm9qj0mdrxdzjx7gjckbi9xk-compute-guix-derivation'
failed to compute the derivation for Guix (version: "b7249aa4726193653e05e694ec4bb311aa4ec6c2"; system: "x86_64-linux";
host version: "1.0.1-3.4a54ed7"; pull-version: 1).
Please report it by email to <bug-guix@gnu.org>.

--
With best regards,
Igor Gajsin




^ permalink raw reply	[flat|nested] 4+ messages in thread

* bug#42005: guix pull has been failed
  2020-06-22 10:31 bug#42005: guix pull has been failed Igor Gajsin
@ 2020-06-22 17:03 ` Marius Bakke
  2020-06-24 10:22   ` Igor Gajsin
  0 siblings, 1 reply; 4+ messages in thread
From: Marius Bakke @ 2020-06-22 17:03 UTC (permalink / raw)
  To: Igor Gajsin, 42005

[-- Attachment #1: Type: text/plain, Size: 1099 bytes --]

Igor Gajsin <igor@gajsin.name> writes:

> Hi Guix,
>
> I found something when run `guix pull`. See the listing below for
> details. Feel free to ask if I can provide more data.
>
> @ build-log 2969932 44
> make[1]: /bin/sh: No such file or directory
> @ build-log 2969932 59
> make[1]: *** [Makefile:201: check-macro-version] Error 127
> @ build-log 2969932 76
> make[1]: Leaving directory '/tmp/guix-build-flex-2.6.4.drv-0/flex-2.6.4/po'
> @ build-log 2969932 48
> make: *** [Makefile:533: all-recursive] Error 1

> @ build-log 2969932 45
> command "make" "-j" "8" failed with status 2
> builder for `/gnu/store/k34nshsbn46hsml399a5dj9r38xmi5kv-flex-2.6.4.drv' failed with exit code 1
> @ build-failed /gnu/store/k34nshsbn46hsml399a5dj9r38xmi5kv-flex-2.6.4.drv - 1 builder for `/gnu/store/k34nshsbn46hsml399a5dj9r38xmi5kv-flex-2.6.4.drv' failed with exit code 1

It looks like 'flex' failed to build, possibly because of parallelism
issues.

Can you try to 'guix build --cores=1 /gnu/store/k34nshsbn46hsml399a5dj9r38xmi5kv-flex-2.6.4.drv' ?

Also, did you intentionally disable binary substitutes?

[-- Attachment #2: signature.asc --]
[-- Type: application/pgp-signature, Size: 487 bytes --]

^ permalink raw reply	[flat|nested] 4+ messages in thread

* bug#42005: guix pull has been failed
  2020-06-22 17:03 ` Marius Bakke
@ 2020-06-24 10:22   ` Igor Gajsin
  2020-06-24 14:33     ` Marius Bakke
  0 siblings, 1 reply; 4+ messages in thread
From: Igor Gajsin @ 2020-06-24 10:22 UTC (permalink / raw)
  To: Marius Bakke; +Cc: 42005, Igor Gajsin

[-- Attachment #1: Type: text/plain, Size: 147 bytes --]

I think I found the root cause. Please, see the output of

guix build --cores=1
/gnu/store/d2v7gzbcv9by7zw8q39v0drff1q8q9da-util-linux-2.35.1.drv


[-- Attachment #2: build.log --]
[-- Type: application/octet-stream, Size: 276312 bytes --]

[-- Attachment #3: Type: text/plain, Size: 1372 bytes --]

in the attachment.

> Also, did you intentionally disable binary substitutes?

I use it as a separate package manager in Ubuntu and I use it 'as
it'. Literally, I configure nothing.

Marius Bakke writes:

> Igor Gajsin <igor@gajsin.name> writes:
>
>> Hi Guix,
>>
>> I found something when run `guix pull`. See the listing below for
>> details. Feel free to ask if I can provide more data.
>>
>> @ build-log 2969932 44
>> make[1]: /bin/sh: No such file or directory
>> @ build-log 2969932 59
>> make[1]: *** [Makefile:201: check-macro-version] Error 127
>> @ build-log 2969932 76
>> make[1]: Leaving directory '/tmp/guix-build-flex-2.6.4.drv-0/flex-2.6.4/po'
>> @ build-log 2969932 48
>> make: *** [Makefile:533: all-recursive] Error 1
>
>> @ build-log 2969932 45
>> command "make" "-j" "8" failed with status 2
>> builder for `/gnu/store/k34nshsbn46hsml399a5dj9r38xmi5kv-flex-2.6.4.drv' failed with exit code 1
>> @ build-failed /gnu/store/k34nshsbn46hsml399a5dj9r38xmi5kv-flex-2.6.4.drv - 1 builder for `/gnu/store/k34nshsbn46hsml399a5dj9r38xmi5kv-flex-2.6.4.drv' failed with exit code 1
>
> It looks like 'flex' failed to build, possibly because of parallelism
> issues.
>
> Can you try to 'guix build --cores=1 /gnu/store/k34nshsbn46hsml399a5dj9r38xmi5kv-flex-2.6.4.drv' ?
>
> Also, did you intentionally disable binary substitutes?


--
With best regards,
Igor Gajsin

^ permalink raw reply	[flat|nested] 4+ messages in thread

* bug#42005: guix pull has been failed
  2020-06-24 10:22   ` Igor Gajsin
@ 2020-06-24 14:33     ` Marius Bakke
  0 siblings, 0 replies; 4+ messages in thread
From: Marius Bakke @ 2020-06-24 14:33 UTC (permalink / raw)
  To: Igor Gajsin; +Cc: 42005, Igor Gajsin

[-- Attachment #1: Type: text/plain, Size: 954 bytes --]

Igor Gajsin <igor@gajsin.name> writes:

> I think I found the root cause. Please, see the output of
>
> guix build --cores=1
> /gnu/store/d2v7gzbcv9by7zw8q39v0drff1q8q9da-util-linux-2.35.1.drv
>
> in the attachment.

Right.  This is the same issue as
<https://issues.guix.gnu.org/issue/41384>.

TL;DR: Upgrade (or downgrade) your kernel.  Or enable substitutes.

>> Also, did you intentionally disable binary substitutes?
>
> I use it as a separate package manager in Ubuntu and I use it 'as
> it'. Literally, I configure nothing.

How did you install Guix?  The installer script asks at the end whether
to enable binary substitutes or not: choosing no will require you to
build everything from source.

If you wish to enable transparent substitutes of pre-built packages from
the build farm, you can run this command:

  sudo guix archive --authorize < /var/guix/profiles/per-user/root/current-guix/share/guix/ci.guix.gnu.org.pub

Hope this helps!  :-)

[-- Attachment #2: signature.asc --]
[-- Type: application/pgp-signature, Size: 487 bytes --]

^ permalink raw reply	[flat|nested] 4+ messages in thread

end of thread, back to index

Thread overview: 4+ messages (download: mbox.gz / follow: Atom feed)
-- links below jump to the message on this page --
2020-06-22 10:31 bug#42005: guix pull has been failed Igor Gajsin
2020-06-22 17:03 ` Marius Bakke
2020-06-24 10:22   ` Igor Gajsin
2020-06-24 14:33     ` Marius Bakke

unofficial mirror of bug-guix@gnu.org 

Archives are clonable:
	git clone --mirror https://yhetil.org/guix-bugs/0 guix-bugs/git/0.git

	# If you have public-inbox 1.1+ installed, you may
	# initialize and index your mirror using the following commands:
	public-inbox-init -V2 guix-bugs guix-bugs/ https://yhetil.org/guix-bugs \
		bug-guix@gnu.org
	public-inbox-index guix-bugs

Example config snippet for mirrors

Newsgroups are available over NNTP:
	nntp://news.yhetil.org/yhetil.gnu.guix.bugs
	nntp://news.gmane.io/gmane.comp.gnu.guix.bugs


AGPL code for this site: git clone https://public-inbox.org/public-inbox.git